匿名 2017-09-11 22:59
[Vue tip]: component lists rendered with v-for should have explicit keys. See https://vuejs.org/guide/list.html#key for more info.
vuewin7

匿名 2017-09-10 23:36
.netcore升级到.netcore时,在调试时能正常运行,在发布运行时,出现“Cannot find compilation library location for package 'Microsoft.Win32.Registry”
.netcoreIP

匿名 2017-09-09 23:03
chrome调试时,在控制台总是显示:You are running Vue in development mode.Make sure to turn on production mode when deploying for production.See more tip at https://vuejs.org/guide/deployment.html
vuepm2

匿名 2017-09-08 23:45
vue能正常运行,结果也正确。但在控制台却显示错误[Vue warn]: Error compiling template:
{{ message }} var app = new Vue({ el: '#app', data: { ...
vueWin7windows

匿名 2017-09-08 00:00
Mysql的批量入库时,执行到PreparedStatment.executeBatch()这一句时,报错:prepared statement contains too many placeholders,提示占位符过多
mysqlwebpack

匿名 2017-09-06 23:48
Error Code: 1418. This function has none of DETERMINISTIC, NO SQL, or READS SQL DATA in its declaration and binary logging is enabled (you might want to use the less safe log_bin_trust_function_creators variable)  
mysqlwindows 2012

匿名 2017-09-05 23:48
webpack构建vue项目时,报错:Module parse failed: .../node_modules/babel-loader/index.js!/.../src/main.js Line 1: Unexpected token You may need an appropriate loader to handle this file type. | import Vue from 'vue';webpack.conf.jsmodule.exports = { entry: './s...
vueWebGL

匿名 2017-09-04 22:04
运行npm run start启动react项目报错。ERROR in xxxx/index.jsModule not found: Error: Error: Cannot resolve module 'react/lib/ReactMount' in D:\app\src\components@ ./src/components/indexjs webpack: bundle is now VALID.
ReactSystemwifiwin7

匿名 2017-09-03 23:48
发布android应用,在构建的时候出错.Error:Execution failed for task ':app:processDebugResources'. > java.io.IOException: Could not delete folder E:\Works\Demo\app\build\...
react nativenpmwin

匿名 2017-09-03 23:18
Invariant Violation:Applicaction 项目名 has not been registered.This is either due to a require() error during initialization or failure to call AppRegistry.registerCommponent.
React-Nativewebview

匿名 2017-09-02 23:34
使用react + webpack,在用babel-loader将jsx文件转成js文件时, 显示Error:SyntaxError main.jsx:Unexpected token错误ERROR in main.js Module build failed: SyntaxError: main.js: Unexpected token 1 | var React = require("react"); > 2 | React.render(

hello world

,document...
react

匿名 2017-09-01 23:02
向后端发送请求时,返回连接被中断错误:EventSource's response has a MIME type ("text/html") that is not "text/event-stream". Aborting the connection.
web

匿名 2017-08-31 20:23
webpack配置react热加载的时候出错。The following modules couldn't be hot updated: (Full reload needed)This is usually because the modules which have changed (and their parents) do not know how to hot reload themselves. See http://webpack.github.io/docs/hot-module-rep...
webapckreact

匿名 2017-08-31 20:14
在命令行窗口输入webpack命令提示如下错误:/node_modules/webpack-core/lib/LoadersList.js:81     r.forEach(function(r) {     ^ TypeError: r.forEach is not a functionwebpack配置:module: { loaders: [ { test: /\.jsx?$/, exclude: /(node_...
webpackscss

匿名 2017-08-31 20:01
启动asp.net core调试,提示地址绑定失败。 An unhandled exception of type 'System.IO.IOException' occurred in Microsoft.AspNetCore.Server.Kestrel.dll: 'Failed to bind to address http://localhost:5000 on the IPv4 loopback interface: port already in use.' Inner exceptions...
.net corevue-devtools

匿名 2017-08-30 19:59
插入手机,Eclipse无法识别手机设备,不能进行调试。
Eclipse

匿名 2017-08-30 19:29
查询城市列表时,出现1046错误select * from cityError Code: 1046. No database selected Select the default DB to be used by double-clicking its name in the SCHEMAS list in the sidebar. 
mysqlstruct

匿名 2017-08-29 20:25
HTTP 错误 403.14 - ForbiddenWeb 服务器被配置为不列出此目录的内容。  
iisstruct

匿名 2017-08-29 20:17
打开asp.net网站页面,出现“The specified module could not be found. ”错误。
iis

匿名 2017-08-29 19:44
iis错误:System.Security.SecurityException “/”应用程序中的服务器错误安全性异常 说明: 应用程序试图执行安全策略不允许的操作。要授予此应用程序所需的权限,请与系统管理员联系,或在配置文件中更改该应用程序的信任级别。 异常详细信息: System.Security.SecurityException: 请求失败。 [SecurityException: 请求失败。] System.RuntimeTypeHandle._GetTypeByName(String name...
iis

匿名 2017-08-28 23:22
在创建表以三个主键做主键,发生Specified key was too long错误。create table bookCatelog (    bookId        varchar(200) not null,    catelogId      varchar(200) not null,    tagId        varchar(200) not null,    primary key (bookId, catelogId, tagId) );
mysqlphp

匿名 2017-08-28 22:48
在导入数据时,出现Data too long for column错误
mysqlphp

hubro 2017-08-27 23:39
在安卓项目中,main.xml文件,%1$s个字 androidspringmvc

匿名 2017-08-27 22:20
运行sudo cat /proc/cpuinfo | grep flags时,出错:/usr/lib/gcc/i686-linux-gnu/4.6.1/include/emmintrin.h:32:3: error: #error "SSE2 instruction set not enabled" In file included from /home/bkhelifa/Downloads/software/gazebo-1.0.0-RC2-x86_64/ deps/opende/src/quic...
C++

匿名 2017-08-26 23:57
用EF查询到数据绑定视图(view)的输入框中,当点提交按钮提交数据更新时,出现更新错误。 System.Data.Entity.Infrastructure.DbUpdateConcurrencyException: Store update, insert, or delete statement affected an unexpected number of rows 
EFFastCGI